{"text_format":"1","workbook":"xlsx","n_sheets":2,"sheets":["Listes","Formations"],"not_rendered":{"charts":0,"images":0,"macros":1,"external_links":0,"defined_names":1,"comments":0,"pivot_tables":0},"unopened":[],"bounds":{"document_bytes":16777216,"sheet_cells":100000,"rows_first":2000,"rows_last":500,"rows_between":2000,"halvings":0,"cell_chars":16384,"cell_head_chars":4096},"cells_cut":0,"cells_raw":0,"read":"whole","date_system":"1900"}

{"sheet":"Listes","index":0,"n_rows":95,"n_cols":6,"rows_kept":95,"cut":false,"hidden":false,"merged":[]}
["NOM","PRENOM",null,"FORMATION",null,"NIVEAU"]
["ACCORD","ELISABETTE",null,"EXCEL",null,"DEBUTANT"]
["ALBERTI","MYRIAM",null,"WORD",null,"INTERMEDIAIRE"]
["BASCHET","FANNY",null,"POWERPOINT",null,"EXPERT"]
["BLOCKEL","ALEXANDRA"]
["BOUBLIL","MALIKA"]
["BONNEUIL","SYLVIE"]
["BROWN","CARLA"]
["CADILHAC","SOPHIE"]
["CARLSON","ANABELLE"]
["CONTI","SAMANTHA"]
["DANO","RACHEL"]
["DAVENAY","CHANTAL"]
["DORMEUIL","CLEMENTINE"]
["HALNA","ALICE"]
["MANUET","ZOE"]
["MARITTO","FRANCESCA"]
["MINELLI","SOPHIE"]
["MISSIRLITCH","ANITA"]
["SASBERGH","ARIELLE"]
["SIMANDOUX","SONIA"]
["VIERA","VANESSA"]
["BAILLY ","SOFIA"]
["BATIGNE","AGATHE"]
["BAUDRY","ELEONORE"]
["BEAUPLAN","MORGANE"]
["BECRIAUX","SARA"]
["BEDEL","CLARISSE"]
["BELIN","MARC"]
["BERNOVILLE","CEDRIC"]
["BIBESCO","NINA"]
["BORDEAUX","FREDERIC"]
["BOUCHER","STEPHANE"]
["BOUKO","CHARLES-HENRY"]
["BRAGANCA","MAELLE"]
["CAHUET","YASMINE"]
["CARAMAN","GABRIELLE"]
["CARNOT","LUCILE"]
["CHENEVIER","CHARLINE"]
["CLERAY","MARINE"]
["CLEVENOT","FANNY"]
["CLOUZIAUX","LANA"]
["CONTI","ELOISE"]
["DAOUDI","MYRIAM"]
["DEBROSSET","MARTIAL"]
["DELAPORTE","CARLA"]
["DENY","AXELLE"]
["DESCHAMPS","VICTOIRE"]
["DOLLFUS","EMMANUEL"]
["DOMERGUE","JEAN-NICOLAS"]
["DREFFUS","CHARLINE"]
["ENJOUBERT","JEROME"]
["ESCHOLIER","LUC"]
["FAURE","WILLIAM"]
["GALLOTTI","ALICIA"]
["GHILINI","ANTONY"]
["GILLET","SEBASTIEN"]
["GLORI","STEPHANE"]
["GRAND","PATRICK"]
["GRASSET","FRANK"]
["HEIBIG","ARNAULT"]
["HEREM","STEVE"]
["JONAS","GREGOIRE"]
["KAZEFF","BORIS"]
["LABADIE","LUC"]
["LACAPE","GILLES"]
["LAMBEL","CARL"]
["LAPEROUSE","AMANDINE"]
["LECUYER","XAVIER"]
["LEE","DAVID"]
["LEGRAND","ALEXANDRE"]
["LESTONNAT","SYLVAIN"]
["MEVIL","ANGE-GUY"]
["NAUDEAU","CYRILLE"]
["NOLHAC","CANDICE"]
["PANGE","BERTRAND"]
["POINCARE","CARL"]
["QUENISSET","THIERRY"]
["RABOT","FRANCOIS"]
["REGNIAULT","PHILIPPE"]
["ROBIQUET","VALENTINE"]
["ROSEMBERT","RICHARD"]
["ROSNY","MARC"]
["ROSSPORTE","JACQUES"]
["ROUGERON","JEAN-PASCAL"]
["RUDEAU","JULIEN"]
["RUDIGER","ALLAN"]
["SCHNEIBER","THIERRY"]
["SORBETS","LEO"]
["SPIRE","MAXIME"]
["VAILLAT","RAYAN"]
["VILLARD","WALTER"]
["WEELLING","PAUL"]
["ZAKSA","MANUEL"]
["ZAMOTTA","JULIEN"]

{"sheet":"Formations","index":1,"n_rows":18,"n_cols":7,"rows_kept":18,"cut":false,"hidden":false,"merged":[]}
[]
[null,"NOM :"]
[null,null,null,null,null,null,"1. Mettre en place le formulaire"]
[null,null,null,null,null,null,"2. Mettre en place les formules de recherche des données"]
[null,null,null,null,null,null,"3. Mettre en place la macro d'ajout dans la liste"]
[]
[]
[null,"NIVEAU :"]
[]
[null,62,null,1,2]
[null,{"$f":"INDEX(Listes!A2:A95,B10,1)","v":"JONAS"},{"$f":"INDEX(Listes!B2:B95,B10,1)","v":"GREGOIRE"},{"$f":"INDEX(Listes!D2:D4,D10,1)","v":"EXCEL"},{"$f":"INDEX(Listes!F2:F4,E10,1)","v":"INTERMEDIAIRE"}]
[]
[null,"NOM","PRENOM","LOGICIEL","NIVEAU"]
[null,"ACCORD","ELISABETTE","EXCEL","DEBUTANT"]
[null,"MANUET","ZOE","WORD","INTERMEDIAIRE"]
[null,"BIBESCO","NINA","POWERPOINT","DEBUTANT"]
[null,"DESCHAMPS","VICTOIRE","WORD","EXPERT"]
[null,"JONAS","GREGOIRE","EXCEL","INTERMEDIAIRE"]